{"text_format":"3","workbook":"xlsx","n_sheets":9,"sheets":["Beschreibung","Gewähr-Aufwand","Material Proj. Nr","Material Proj. Nr (2)","Material Proj. Nr (3)","Material Proj. Nr (4)","Stundensatz","DropDown","SuSa"],"read":"whole","date_system":"1900"}

{"sheet":"Beschreibung","index":0,"n_rows":55,"n_cols":3,"rows_kept":55}
["Beschreibung:"]
[]
[]
["Sehr geehrte Damen und Herren,"]
[]
["Sie sind verpflichtet auf Dienstleistungen und Warenumsätzen 2 Jahre Gewährleistungen zu leisten."]
["D.h. sollte es zu einer Mängelrüge seitens des Kunden bestehen, müssen Sie reagieren und nachbesseren."]
["Diese Tätigkeiten dürfen Sie allerdings nicht in Rechnung stellen."]
["Aber, die hier entstandenen (Selbst- oder auch Netto) Kosten, dürfen und müssen Sie in eine Rückstellung einstellen."]
["Der Gewinn mindert sich somit entsprechend diesem Wert."]
[]
["Um die Gewährleistungsrückstellung für den Jahresabschlusses und für den Fall einer Betriebsprüfung dokumentiert "]
["darlegen zu können, benötigen Sie eine Grundaufzeichnung."]
["Für Sie haben wir die im Anhang befindliche Tabelle „Gewährleistungsberechnung Mandant“ "]
["entwickelt und stellen Ihnen diese zur Verfügung."]
[]
[]
["Das handling:"]
[]
[]
["Tabellenblatt : Gewähr-Aufwand"]
[]
["!! Wichtig hierbei ist die Vergabe und Eintragung der Projekt Nummer !!"]
[]
["Beispiel Eintragungen:"]
["In den Zeilen 4 bis 6 und 9 haben wir Ihnen ein Beispiel eingetragen. Bitte löschen Sie hier gemachten Werte und ersetzen "]
["diese durch entsprechende Daten."]
[]
["Bitte erfassen Sie in der Tabelle folgende Werte:"]
[]
["Spalte A: ",null,"Projekt Nummer Die von Ihnen intern vergebene Nummer"]
["Spalte B: ",null,"Projekt Name entsprechend Spalte A den Namen (z.B. Auftraggeber, o.ä.)"]
["Spalte C: ",null,"Datum An welchem Tag wurden Gewährleistungen ausgeführt. Hier kommt es nicht auf die Sortierreihenfolge an."]
[null,null,"Für das Projekt 0815 können Sie in beliebig angeordneten Zeilen Eintragungen machen, diese werden addiert"]
["Spalte D: ",null,"Teilauftrag Bitte tragen Sie hier für welchen Auftrag / Teilauftrag Sie tätig geworden sind."]
["Spalte E: ",null,"Arbeiter Bitte wählen Sie hier per DropDown Feld (Pfeil rechts an der Zelle geheftet) die entsprechenden Namen aus."]
[null,null,"Die hier hinterlegten Werte werden in Spalte G – Stundensatz angezeigt."]
["Spalte F: ",null,"Stundenanzahl Bitte tragen Sie die für diese Gewährleistung angefallenen Stunden (incl. An- und Abfahrt) ein"]
["Spalte G bis H: ",null,"Bitte tragen Sie hier keine Werte ein, da diese sich selbst berechnet"]
["Spalte I: ",null,"Bitte tragen Sie hier die Material Kosten zum Einkaufspreis Netto ein."]
{"$rows_left_out":16}
{"sheet":"Gewähr-Aufwand","index":1,"n_rows":299,"n_cols":10,"rows_kept":299}
["Gewährleistungsaufzeichnung"]
[]
["Projekt Nr.","Projekt Name","Datum der \nGewährleistung","Gewährleistungsobjekt \n(Teilauftrag)","Arbeiter","Stunden-\nanzahl","Stunden-\nsatz","Stunden-\nsumme","Material\n(Selbstkosten)","Gesamtkosten"]
[11111,"Muster Projekt","2020-05-18","Mauerbau","Name 1 Chef",15,{"$f":"IF(E4=\"\",\"\",VLOOKUP(E4,Stundensatz!$B$15:$C$21,2,FALSE))","v":{"v":42.56476086078578,"d":"42.56 €"}},{"$f":"IF(F4=\"\",\"\",(F4*G4))","v":{"v":638.4714129117867,"d":"638.47 €"}},null,{"$f":"IF(COUNTIF($A$3:A4,A4)>1,\"\",IF(A4=\"\",\"\",SUMIF($A$4:$I$350,A4,$H$4:H350)+(SUMIF($A$4:$I$350,A4,$I$4:I350))))","v":{"v":4592.523554202965,"d":"4,592.52 €"}}]
[11111,"Muster Projekt","2020-05-18","Mauerbau","Name 2 ",16.75,{"$f":"IF(E5=\"\",\"\",VLOOKUP(E5,Stundensatz!$B$15:$C$21,2,FALSE))","v":{"v":68.04,"d":"68.04 €"}},{"$f":"IF(F5=\"\",\"\",(F5*G5))","v":{"v":1139.67,"d":"1,139.67 €"}},{"v":1500,"d":"1,500.00 €"},{"$f":"IF(COUNTIF($A$3:A5,A5)>1,\"\",IF(A5=\"\",\"\",SUMIF($A$4:$I$350,A5,$H$4:H351)+(SUMIF($A$4:$I$350,A5,$I$4:I351))))","v":""}]
[11111,"Muster Projekt","2020-05-18","Mauerbau","Name 3",17.5,{"$f":"IF(E6=\"\",\"\",VLOOKUP(E6,Stundensatz!$B$15:$C$21,2,FALSE))","v":{"v":64.13,"d":"64.13 €"}},{"$f":"IF(F6=\"\",\"\",(F6*G6))","v":{"v":1122.2749999999999,"d":"1,122.28 €"}},null,{"$f":"IF(COUNTIF($A$3:A6,A6)>1,\"\",IF(A6=\"\",\"\",SUMIF($A$4:$I$350,A6,$H$4:H352)+(SUMIF($A$4:$I$350,A6,$I$4:I352))))","v":""}]
[{"$nulls":6},{"$f":"IF(E7=\"\",\"\",VLOOKUP(E7,Stundensatz!$B$15:$C$21,2,FALSE))","v":""},{"$f":"IF(F7=\"\",\"\",(F7*G7))","v":""},null,{"$f":"IF(COUNTIF($A$3:A7,A7)>1,\"\",IF(A7=\"\",\"\",SUMIF($A$4:$I$350,A7,$H$4:H353)+(SUMIF($A$4:$I$350,A7,$I$4:I353))))","v":""}]
[{"$nulls":6},{"$f":"IF(E8=\"\",\"\",VLOOKUP(E8,Stundensatz!$B$15:$C$21,2,FALSE))","v":""},"",null,{"$f":"IF(COUNTIF($A$3:A8,A8)>1,\"\",IF(A8=\"\",\"\",SUMIF($A$4:$I$350,A8,$H$4:H354)+(SUMIF($A$4:$I$350,A8,$I$4:I354))))","v":""}]
[11111,"Muster Projekt","2020-05-19","Mauerbau / Kontrolle","Name 1 Chef",1.5,{"$f":"IF(E9=\"\",\"\",VLOOKUP(E9,Stundensatz!$B$15:$C$21,2,FALSE))","v":{"v":42.56476086078578,"d":"42.56 €"}},{"v":63.84714129117867,"d":"63.85 €"},null,{"$f":"IF(COUNTIF($A$3:A9,A9)>1,\"\",IF(A9=\"\",\"\",SUMIF($A$4:$I$350,A9,$H$4:H355)+(SUMIF($A$4:$I$350,A9,$I$4:I355))))","v":""}]
[{"$nulls":6},{"$f":"IF(E10=\"\",\"\",VLOOKUP(E10,Stundensatz!$B$15:$C$21,2,FALSE))","v":""},"",null,{"$f":"IF(COUNTIF($A$3:A10,A10)>1,\"\",IF(A10=\"\",\"\",SUMIF($A$4:$I$350,A10,$H$4:H356)+(SUMIF($A$4:$I$350,A10,$I$4:I356))))","v":""}]
[{"$nulls":6},{"$f":"IF(E11=\"\",\"\",VLOOKUP(E11,Stundensatz!$B$15:$C$21,2,FALSE))","v":""},"",null,{"$f":"IF(COUNTIF($A$3:A11,A11)>1,\"\",IF(A11=\"\",\"\",SUMIF($A$4:$I$350,A11,$H$4:H357)+(SUMIF($A$4:$I$350,A11,$I$4:I357))))","v":""}]
[11111,"Muster Projekt","2020-05-25","Mauerbau / Nachkalkulation","Name 3",2,{"$f":"IF(E12=\"\",\"\",VLOOKUP(E12,Stundensatz!$B$15:$C$21,2,FALSE))","v":{"v":64.13,"d":"64.13 €"}},{"$f":"IF(F12=\"\",\"\",(F12*G12))","v":{"v":128.26,"d":"128.26 €"}},null,{"$f":"IF(COUNTIF($A$3:A12,A12)>1,\"\",IF(A12=\"\",\"\",SUMIF($A$4:$I$350,A12,$H$4:H358)+(SUMIF($A$4:$I$350,A12,$I$4:I358))))","v":""}]
[{"$nulls":6},{"$f":"IF(E13=\"\",\"\",VLOOKUP(E13,Stundensatz!$B$15:$C$21,2,FALSE))","v":""},"",null,{"$f":"IF(COUNTIF($A$3:A13,A13)>1,\"\",IF(A13=\"\",\"\",SUMIF($A$4:$I$350,A13,$H$4:H359)+(SUMIF($A$4:$I$350,A13,$I$4:I359))))","v":""}]
[{"$nulls":6},{"$f":"IF(E14=\"\",\"\",VLOOKUP(E14,Stundensatz!$B$15:$C$21,2,FALSE))","v":""},"",null,{"$f":"IF(COUNTIF($A$3:A14,A14)>1,\"\",IF(A14=\"\",\"\",SUMIF($A$4:$I$350,A14,$H$4:H360)+(SUMIF($A$4:$I$350,A14,$I$4:I360))))","v":""}]
[{"$nulls":6},{"$f":"IF(E15=\"\",\"\",VLOOKUP(E15,Stundensatz!$B$15:$C$21,2,FALSE))","v":""},"",null,{"$f":"IF(COUNTIF($A$3:A15,A15)>1,\"\",IF(A15=\"\",\"\",SUMIF($A$4:$I$350,A15,$H$4:H361)+(SUMIF($A$4:$I$350,A15,$I$4:I361))))","v":""}]
[{"$nulls":6},{"$f":"IF(E16=\"\",\"\",VLOOKUP(E16,Stundensatz!$B$15:$C$21,2,FALSE))","v":""},"",null,{"$f":"IF(COUNTIF($A$3:A16,A16)>1,\"\",IF(A16=\"\",\"\",SUMIF($A$4:$I$350,A16,$H$4:H362)+(SUMIF($A$4:$I$350,A16,$I$4:I362))))","v":""}]
[{"$nulls":6},{"$f":"IF(E17=\"\",\"\",VLOOKUP(E17,Stundensatz!$B$15:$C$21,2,FALSE))","v":""},"",null,{"$f":"IF(COUNTIF($A$3:A17,A17)>1,\"\",IF(A17=\"\",\"\",SUMIF($A$4:$I$350,A17,$H$4:H363)+(SUMIF($A$4:$I$350,A17,$I$4:I363))))","v":""}]
[{"$nulls":6},{"$f":"IF(E18=\"\",\"\",VLOOKUP(E18,Stundensatz!$B$15:$C$21,2,FALSE))","v":""},"",null,{"$f":"IF(COUNTIF($A$3:A18,A18)>1,\"\",IF(A18=\"\",\"\",SUMIF($A$4:$I$350,A18,$H$4:H364)+(SUMIF($A$4:$I$350,A18,$I$4:I364))))","v":""}]
[{"$nulls":6},{"$f":"IF(E19=\"\",\"\",VLOOKUP(E19,Stundensatz!$B$15:$C$21,2,FALSE))","v":""},"",null,{"$f":"IF(COUNTIF($A$3:A19,A19)>1,\"\",IF(A19=\"\",\"\",SUMIF($A$4:$I$350,A19,$H$4:H365)+(SUMIF($A$4:$I$350,A19,$I$4:I365))))","v":""}]
[{"$nulls":6},{"$f":"IF(E20=\"\",\"\",VLOOKUP(E20,Stundensatz!$B$15:$C$21,2,FALSE))","v":""},"",null,{"$f":"IF(COUNTIF($A$3:A20,A20)>1,\"\",IF(A20=\"\",\"\",SUMIF($A$4:$I$350,A20,$H$4:H366)+(SUMIF($A$4:$I$350,A20,$I$4:I366))))","v":""}]
[{"$nulls":6},{"$f":"IF(E21=\"\",\"\",VLOOKUP(E21,Stundensatz!$B$15:$C$21,2,FALSE))","v":""},"",null,{"$f":"IF(COUNTIF($A$3:A21,A21)>1,\"\",IF(A21=\"\",\"\",SUMIF($A$4:$I$350,A21,$H$4:H367)+(SUMIF($A$4:$I$350,A21,$I$4:I367))))","v":""}]
[{"$nulls":6},{"$f":"IF(E22=\"\",\"\",VLOOKUP(E22,Stundensatz!$B$15:$C$21,2,FALSE))","v":""},"",null,{"$f":"IF(COUNTIF($A$3:A22,A22)>1,\"\",IF(A22=\"\",\"\",SUMIF($A$4:$I$350,A22,$H$4:H368)+(SUMIF($A$4:$I$350,A22,$I$4:I368))))","v":""}]
[{"$nulls":6},{"$f":"IF(E23=\"\",\"\",VLOOKUP(E23,Stundensatz!$B$15:$C$21,2,FALSE))","v":""},"",null,{"$f":"IF(COUNTIF($A$3:A23,A23)>1,\"\",IF(A23=\"\",\"\",SUMIF($A$4:$I$350,A23,$H$4:H369)+(SUMIF($A$4:$I$350,A23,$I$4:I369))))","v":""}]
[{"$nulls":6},{"$f":"IF(E24=\"\",\"\",VLOOKUP(E24,Stundensatz!$B$15:$C$21,2,FALSE))","v":""},"",null,{"$f":"IF(COUNTIF($A$3:A24,A24)>1,\"\",IF(A24=\"\",\"\",SUMIF($A$4:$I$350,A24,$H$4:H370)+(SUMIF($A$4:$I$350,A24,$I$4:I370))))","v":""}]
[{"$nulls":6},{"$f":"IF(E25=\"\",\"\",VLOOKUP(E25,Stundensatz!$B$15:$C$21,2,FALSE))","v":""},"",null,{"$f":"IF(COUNTIF($A$3:A25,A25)>1,\"\",IF(A25=\"\",\"\",SUMIF($A$4:$I$350,A25,$H$4:H371)+(SUMIF($A$4:$I$350,A25,$I$4:I371))))","v":""}]
[{"$nulls":6},{"$f":"IF(E26=\"\",\"\",VLOOKUP(E26,Stundensatz!$B$15:$C$21,2,FALSE))","v":""},"",null,{"$f":"IF(COUNTIF($A$3:A26,A26)>1,\"\",IF(A26=\"\",\"\",SUMIF($A$4:$I$350,A26,$H$4:H372)+(SUMIF($A$4:$I$350,A26,$I$4:I372))))","v":""}]
[{"$nulls":6},{"$f":"IF(E27=\"\",\"\",VLOOKUP(E27,Stundensatz!$B$15:$C$21,2,FALSE))","v":""},"",null,{"$f":"IF(COUNTIF($A$3:A27,A27)>1,\"\",IF(A27=\"\",\"\",SUMIF($A$4:$I$350,A27,$H$4:H373)+(SUMIF($A$4:$I$350,A27,$I$4:I373))))","v":""}]
[{"$nulls":6},{"$f":"IF(E28=\"\",\"\",VLOOKUP(E28,Stundensatz!$B$15:$C$21,2,FALSE))","v":""},"",null,{"$f":"IF(COUNTIF($A$3:A28,A28)>1,\"\",IF(A28=\"\",\"\",SUMIF($A$4:$I$350,A28,$H$4:H374)+(SUMIF($A$4:$I$350,A28,$I$4:I374))))","v":""}]
[{"$nulls":6},{"$f":"IF(E29=\"\",\"\",VLOOKUP(E29,Stundensatz!$B$15:$C$21,2,FALSE))","v":""},"",null,{"$f":"IF(COUNTIF($A$3:A29,A29)>1,\"\",IF(A29=\"\",\"\",SUMIF($A$4:$I$350,A29,$H$4:H375)+(SUMIF($A$4:$I$350,A29,$I$4:I375))))","v":""}]
[{"$nulls":6},{"$f":"IF(E30=\"\",\"\",VLOOKUP(E30,Stundensatz!$B$15:$C$21,2,FALSE))","v":""},"",null,{"$f":"IF(COUNTIF($A$3:A30,A30)>1,\"\",IF(A30=\"\",\"\",SUMIF($A$4:$I$350,A30,$H$4:H376)+(SUMIF($A$4:$I$350,A30,$I$4:I376))))","v":""}]
[{"$nulls":6},{"$f":"IF(E31=\"\",\"\",VLOOKUP(E31,Stundensatz!$B$15:$C$21,2,FALSE))","v":""},"",null,{"$f":"IF(COUNTIF($A$3:A31,A31)>1,\"\",IF(A31=\"\",\"\",SUMIF($A$4:$I$350,A31,$H$4:H377)+(SUMIF($A$4:$I$350,A31,$I$4:I377))))","v":""}]
[{"$nulls":6},{"$f":"IF(E32=\"\",\"\",VLOOKUP(E32,Stundensatz!$B$15:$C$21,2,FALSE))","v":""},"",null,{"$f":"IF(COUNTIF($A$3:A32,A32)>1,\"\",IF(A32=\"\",\"\",SUMIF($A$4:$I$350,A32,$H$4:H378)+(SUMIF($A$4:$I$350,A32,$I$4:I378))))","v":""}]
[{"$nulls":6},{"$f":"IF(E33=\"\",\"\",VLOOKUP(E33,Stundensatz!$B$15:$C$21,2,FALSE))","v":""},"",null,{"$f":"IF(COUNTIF($A$3:A33,A33)>1,\"\",IF(A33=\"\",\"\",SUMIF($A$4:$I$350,A33,$H$4:H379)+(SUMIF($A$4:$I$350,A33,$I$4:I379))))","v":""}]
[{"$nulls":6},{"$f":"IF(E34=\"\",\"\",VLOOKUP(E34,Stundensatz!$B$15:$C$21,2,FALSE))","v":""},"",null,{"$f":"IF(COUNTIF($A$3:A34,A34)>1,\"\",IF(A34=\"\",\"\",SUMIF($A$4:$I$350,A34,$H$4:H380)+(SUMIF($A$4:$I$350,A34,$I$4:I380))))","v":""}]
[{"$nulls":6},{"$f":"IF(E35=\"\",\"\",VLOOKUP(E35,Stundensatz!$B$15:$C$21,2,FALSE))","v":""},"",null,{"$f":"IF(COUNTIF($A$3:A35,A35)>1,\"\",IF(A35=\"\",\"\",SUMIF($A$4:$I$350,A35,$H$4:H381)+(SUMIF($A$4:$I$350,A35,$I$4:I381))))","v":""}]
[{"$nulls":6},{"$f":"IF(E36=\"\",\"\",VLOOKUP(E36,Stundensatz!$B$15:$C$21,2,FALSE))","v":""},"",null,{"$f":"IF(COUNTIF($A$3:A36,A36)>1,\"\",IF(A36=\"\",\"\",SUMIF($A$4:$I$350,A36,$H$4:H382)+(SUMIF($A$4:$I$350,A36,$I$4:I382))))","v":""}]
[{"$nulls":6},{"$f":"IF(E37=\"\",\"\",VLOOKUP(E37,Stundensatz!$B$15:$C$21,2,FALSE))","v":""},"",null,{"$f":"IF(COUNTIF($A$3:A37,A37)>1,\"\",IF(A37=\"\",\"\",SUMIF($A$4:$I$350,A37,$H$4:H383)+(SUMIF($A$4:$I$350,A37,$I$4:I383))))","v":""}]
[{"$nulls":6},{"$f":"IF(E38=\"\",\"\",VLOOKUP(E38,Stundensatz!$B$15:$C$21,2,FALSE))","v":""},"",null,{"$f":"IF(COUNTIF($A$3:A38,A38)>1,\"\",IF(A38=\"\",\"\",SUMIF($A$4:$I$350,A38,$H$4:H384)+(SUMIF($A$4:$I$350,A38,$I$4:I384))))","v":""}]
[{"$nulls":6},{"$f":"IF(E39=\"\",\"\",VLOOKUP(E39,Stundensatz!$B$15:$C$21,2,FALSE))","v":""},"",null,{"$f":"IF(COUNTIF($A$3:A39,A39)>1,\"\",IF(A39=\"\",\"\",SUMIF($A$4:$I$350,A39,$H$4:H385)+(SUMIF($A$4:$I$350,A39,$I$4:I385))))","v":""}]
[{"$nulls":6},{"$f":"IF(E40=\"\",\"\",VLOOKUP(E40,Stundensatz!$B$15:$C$21,2,FALSE))","v":""},"",null,{"$f":"IF(COUNTIF($A$3:A40,A40)>1,\"\",IF(A40=\"\",\"\",SUMIF($A$4:$I$350,A40,$H$4:H386)+(SUMIF($A$4:$I$350,A40,$I$4:I386))))","v":""}]
{"$rows_left_out":260}
{"sheet":"Material Proj. Nr","index":2,"n_rows":484,"n_cols":6,"rows_kept":484,"merged":[[0,0,0,4]]}
["Materialaufzeichnung und Externe Kosten für Gewährleistungen:"]
[]
[]
["Projekt \nNummer:","Nummer Eintragen"]
["Projekt Name:","Name Eintragen"]
[]
[]
["Datum","Materialbezeichnung/ \nExterne Dienstleister:","Anzahl","Bez.","Netto Einzel-\nEinkaufwert","Summe"]
["2020-05-18","Zement",2,"Kg",{"v":18,"d":"18.00 €"},{"$f":"IF(E9=\"\",\"\",C9*E9)","v":{"v":36,"d":"36.00 €"}}]
[{"$nulls":3},"Std.Satz",null,{"$f":"IF(E10=\"\",\"\",C10*E10)","v":""}]
[{"$nulls":5},""]
[{"$nulls":5},""]
[{"$nulls":5},""]
[{"$nulls":5},""]
[{"$nulls":5},""]
[{"$nulls":5},""]
[{"$nulls":5},""]
[{"$nulls":5},""]
[{"$nulls":5},""]
[{"$nulls":5},""]
[{"$nulls":5},""]
[{"$nulls":5},""]
[{"$nulls":5},""]
[{"$nulls":5},""]
[{"$nulls":5},""]
[{"$nulls":5},""]
[{"$nulls":5},""]
[{"$nulls":5},""]
[{"$nulls":5},""]
[{"$nulls":5},""]
[{"$nulls":5},""]
[{"$nulls":5},""]
[{"$nulls":5},""]
[{"$nulls":5},""]
[{"$nulls":5},""]
[{"$nulls":5},""]
[{"$nulls":5},""]
[{"$nulls":5},""]
[{"$nulls":5},""]
[{"$nulls":5},""]
{"$rows_left_out":445}
{"sheet":"Material Proj. Nr (2)","index":3,"n_rows":484,"n_cols":6,"rows_kept":484,"merged":[[0,0,0,4]]}
["Materialaufzeichnung und Externe Kosten für Gewährleistungen:"]
[]
[]
["Projekt \nNummer:","Nummer Eintragen"]
["Projekt Name:","Name Eintragen"]
[]
[]
["Datum","Materialbezeichnung/ \nExterne Dienstleister:","Anzahl","Bez.","Netto Einzel-\nEinkaufwert","Summe"]
["2020-05-18","Zement",2,null,{"v":18,"d":"18.00 €"},{"$f":"IF(E9=\"\",\"\",C9*E9)","v":{"v":36,"d":"36.00 €"}}]
[{"$nulls":5},{"$f":"IF(E10=\"\",\"\",C10*E10)","v":""}]
[{"$nulls":5},""]
[{"$nulls":5},""]
[{"$nulls":5},""]
[{"$nulls":5},""]
[{"$nulls":5},""]
[{"$nulls":5},""]
[{"$nulls":5},""]
[{"$nulls":5},""]
[{"$nulls":5},""]
[{"$nulls":5},""]
[{"$nulls":5},""]
[{"$nulls":5},""]
[{"$nulls":5},""]
[{"$nulls":5},""]
[{"$nulls":5},""]
[{"$nulls":5},""]
[{"$nulls":5},""]
[{"$nulls":5},""]
[{"$nulls":5},""]
[{"$nulls":5},""]
[{"$nulls":5},""]
[{"$nulls":5},""]
[{"$nulls":5},""]
[{"$nulls":5},""]
[{"$nulls":5},""]
[{"$nulls":5},""]
[{"$nulls":5},""]
[{"$nulls":5},""]
[{"$nulls":5},""]
[{"$nulls":5},""]
{"$rows_left_out":445}
{"sheet":"Material Proj. Nr (3)","index":4,"n_rows":484,"n_cols":6,"rows_kept":484,"merged":[[0,0,0,4]]}
["Materialaufzeichnung und Externe Kosten für Gewährleistungen:"]
[]
[]
["Projekt \nNummer:","Nummer Eintragen"]
["Projekt Name:","Name Eintragen"]
[]
[]
["Datum","Materialbezeichnung/ \nExterne Dienstleister:","Anzahl","Bez.","Netto Einzel-\nEinkaufwert","Summe"]
["2020-05-18","Zement",2,"Kg",{"v":18,"d":"18.00 €"},{"$f":"IF(E9=\"\",\"\",C9*E9)","v":{"v":36,"d":"36.00 €"}}]
[{"$nulls":5},{"$f":"IF(E10=\"\",\"\",C10*E10)","v":""}]
[{"$nulls":5},""]
[{"$nulls":5},""]
[{"$nulls":5},""]
[{"$nulls":5},""]
[{"$nulls":5},""]
[{"$nulls":5},""]
[{"$nulls":5},""]
[{"$nulls":5},""]
[{"$nulls":5},""]
[{"$nulls":5},""]
[{"$nulls":5},""]
[{"$nulls":5},""]
[{"$nulls":5},""]
[{"$nulls":5},""]
[{"$nulls":5},""]
[{"$nulls":5},""]
[{"$nulls":5},""]
[{"$nulls":5},""]
[{"$nulls":5},""]
[{"$nulls":5},""]
[{"$nulls":5},""]
[{"$nulls":5},""]
[{"$nulls":5},""]
[{"$nulls":5},""]
[{"$nulls":5},""]
[{"$nulls":5},""]
[{"$nulls":5},""]
[{"$nulls":5},""]
[{"$nulls":5},""]
[{"$nulls":5},""]
{"$rows_left_out":445}
{"sheet":"Material Proj. Nr (4)","index":5,"n_rows":484,"n_cols":6,"rows_kept":484,"merged":[[0,0,0,4]]}
["Materialaufzeichnung und Externe Kosten für Gewährleistungen:"]
[]
[]
["Projekt \nNummer:","Nummer Eintragen"]
["Projekt Name:","Name Eintragen"]
[]
[]
["Datum","Materialbezeichnung/ \nExterne Dienstleister:","Anzahl","Bez.","Netto Einzel-\nEinkaufwert","Summe"]
["2020-05-18","Zement",2,null,{"v":18,"d":"18.00 €"},{"$f":"IF(E9=\"\",\"\",C9*E9)","v":{"v":36,"d":"36.00 €"}}]
[{"$nulls":5},{"$f":"IF(E10=\"\",\"\",C10*E10)","v":""}]
[{"$nulls":5},""]
[{"$nulls":5},""]
[{"$nulls":5},""]
[{"$nulls":5},""]
[{"$nulls":5},""]
[{"$nulls":5},""]
[{"$nulls":5},""]
[{"$nulls":5},""]
[{"$nulls":5},""]
[{"$nulls":5},""]
[{"$nulls":5},""]
[{"$nulls":5},""]
[{"$nulls":5},""]
[{"$nulls":5},""]
[{"$nulls":5},""]
[{"$nulls":5},""]
[{"$nulls":5},""]
[{"$nulls":5},""]
[{"$nulls":5},""]
[{"$nulls":5},""]
[{"$nulls":5},""]
[{"$nulls":5},""]
[{"$nulls":5},""]
[{"$nulls":5},""]
[{"$nulls":5},""]
[{"$nulls":5},""]
[{"$nulls":5},""]
[{"$nulls":5},""]
[{"$nulls":5},""]
[{"$nulls":5},""]
{"$rows_left_out":445}
{"sheet":"Stundensatz","index":6,"n_rows":17,"n_cols":4,"rows_kept":17}
["Arbeiterverzeichnis"]
[]
["Berechnung Stundensatz (Selbstkosten)"]
[]
[]
[null,"Unternehmerlohn"]
[null,"Gewinn ",{"v":80000,"d":"80,000.00 €"},"lt. Letzter GuV handelsrechtlich"]
[null,"Sozial Versicherung",{"$f":"5294+616+1161+1462","v":{"v":8533,"d":"8,533.00 €"}},"KV des Arbeitgebers"]
[null,"Stunden p.a.",{"$f":"173.33*12","v":{"v":2079.96,"d":"2,079.96 Std."}},"(basierend auf 40 Stundenwoche)"]
[null,"Stundensatz",{"$f":"(C7+C8)/C9","v":{"v":42.56476086078578,"d":"42.56 €"}},"(Selbstkosten Arbeitgeber)"]
[]
[]
[]
["Personal Nr.","Name","Stundensatz\n(Selbstkosten)"]
[1,"Name 1 Chef",{"$f":"C10","v":{"v":42.56476086078578,"d":"42.56 €"}}]
[2,"Name 2 ",{"v":68.04,"d":"68.04 €"}]
[3,"Name 3",{"v":64.13,"d":"64.13 €"}]

{"sheet":"DropDown","index":7,"n_rows":10,"n_cols":1,"rows_kept":10}
["Dropdown"]
[]
[]
["Bezeichnung"]
[]
["Stück"]
["Meter"]
["m²"]
["Kg"]
["Std.Satz"]

{"sheet":"SuSa","index":8,"n_rows":122,"n_cols":12,"rows_kept":122,"hidden":true,"merged":[[0,0,0,11]]}
["Kanzlei-Rechnungswesen - RW - 352427/10902/2019 / Achim Koch - Summen- und Saldenliste - Summen und Salden (pro Monat) Januar-Dezember"]
["Konto","Beschriftung","EB-Wert","S","H","Saldo","S","H","Jan 2019 - Dez 2019 \nSoll"," \nHaben","kum. Werte \nSoll"," \nHaben"]
[235,"Grundstückswert bebauter Grundstücke",{"v":4500,"d":"4,500.00"},"S",null,{"v":4500,"d":"4,500.00"},"S"]
[236,"Grundstück",{"v":3750,"d":"3,750.00"},"S",null,{"v":3750,"d":"3,750.00"},"S"]
[240,"Geschäftsbauten",{"v":11719,"d":"11,719.00"},"S",null,{"v":10989,"d":"10,989.00"},"S",null,{"v":0,"d":"0.00"},{"v":730,"d":"730.00"},{"v":0,"d":"0.00"},{"v":730,"d":"730.00"}]
[241,"Geschäftsbauten Halle - neu",{"v":10264,"d":"10,264.00"},"S",null,{"v":9723,"d":"9,723.00"},"S",null,{"v":0,"d":"0.00"},{"v":541,"d":"541.00"},{"v":0,"d":"0.00"},{"v":541,"d":"541.00"}]
[440,"Maschinen",518.57,"S",null,369.55,"S",null,{"v":0,"d":"0.00"},149.02,{"v":0,"d":"0.00"},149.02]
[540,"Lkw",{"v":62464.51,"d":"62,464.51"},"S",null,{"v":53127,"d":"53,127.00"},"S",null,{"v":0,"d":"0.00"},{"v":9337.51,"d":"9,337.51"},{"v":0,"d":"0.00"},{"v":9337.51,"d":"9,337.51"}]
[560,"Sonstige Transportmittel",{"v":23689.51,"d":"23,689.51"},"S",null,{"v":20917.51,"d":"20,917.51"},"S",null,{"v":2167.14,"d":"2,167.14"},{"v":4939.14,"d":"4,939.14"},{"v":2167.14,"d":"2,167.14"},{"v":4939.14,"d":"4,939.14"}]
[620,"Werkzeuge",{"v":2,"d":"2.00"},"S",null,{"v":2,"d":"2.00"},"S"]
[630,"Betriebsausstattung",{"v":534,"d":"534.00"},"S",null,{"v":441,"d":"441.00"},"S",null,{"v":0,"d":"0.00"},{"v":93,"d":"93.00"},{"v":0,"d":"0.00"},{"v":93,"d":"93.00"}]
[650,"Büroeinrichtung",97.51,"S",null,{"v":1077,"d":"1,077.00"},"S",null,{"v":1138.25,"d":"1,138.25"},158.76,{"v":1138.25,"d":"1,138.25"},158.76]
[660,"Gerüst- und Schalungsmaterial",{"v":3520.53,"d":"3,520.53"},"S",null,{"v":5836.53,"d":"5,836.53"},"S",null,{"v":3172.92,"d":"3,172.92"},856.92,{"v":3172.92,"d":"3,172.92"},856.92]
[670,"Geringwertige Wirtschaftsgüter",{"v":189,"d":"189.00"},"S",null,{"v":105,"d":"105.00"},"S",null,{"v":2627.32,"d":"2,627.32"},{"v":2711.32,"d":"2,711.32"},{"v":2627.32,"d":"2,627.32"},{"v":2711.32,"d":"2,711.32"}]
[690,"Sonstige Betriebs-u.Gesch.ausstattung",{"v":3425,"d":"3,425.00"},"S",null,{"v":4898,"d":"4,898.00"},"S",null,{"v":2809.55,"d":"2,809.55"},{"v":1336.55,"d":"1,336.55"},{"v":2809.55,"d":"2,809.55"},{"v":1336.55,"d":"1,336.55"}]
[1140,"Waren",{"v":4884.52,"d":"4,884.52"},"S",null,{"v":4347.2,"d":"4,347.20"},"S",null,{"v":0,"d":"0.00"},537.32,{"v":0,"d":"0.00"},537.32]
[1210,"Forderungen aus Lieferungen u.Leistung",{"v":14423.54,"d":"14,423.54"},"S",null,394.17,"S",null,655.28,{"v":14684.65,"d":"14,684.65"},655.28,{"v":14684.65,"d":"14,684.65"}]
[1300,"Sonstige Vermögensgegenstände",{"v":1308.56,"d":"1,308.56"},"S",null,{"v":0,"d":"0.00"},null,null,{"v":0,"d":"0.00"},{"v":1308.56,"d":"1,308.56"},{"v":0,"d":"0.00"},{"v":1308.56,"d":"1,308.56"}]
[1302,"Forderung ULAK",{"v":1527.46,"d":"1,527.46"},"S",null,541.54,"S",null,{"v":8155.76,"d":"8,155.76"},{"v":9141.68,"d":"9,141.68"},{"v":8155.76,"d":"8,155.76"},{"v":9141.68,"d":"9,141.68"}]
[1369,"Forderungen ggb. Krankenkasse aus AAG",{"$nulls":3},{"v":0,"d":"0.00"},null,null,374.92,374.92,374.92,374.92]
[1401,"Abziehbare Vorsteuer 7%",{"$nulls":3},48.31,"S",null,48.31,{"v":0,"d":"0.00"},48.31,{"v":0,"d":"0.00"}]
[1406,"Abziehbare Vorsteuer 19%",{"$nulls":3},{"v":20011.81,"d":"20,011.81"},"S",null,{"v":20035.76,"d":"20,035.76"},23.95,{"v":20035.76,"d":"20,035.76"},23.95]
[1407,"Abziehbare Vorsteuer § 13b UStG 19%",{"$nulls":3},{"v":1596.96,"d":"1,596.96"},"S",null,{"v":1596.96,"d":"1,596.96"},{"v":0,"d":"0.00"},{"v":1596.96,"d":"1,596.96"},{"v":0,"d":"0.00"}]
[1434,"Vorst. in Folgeperiode /-jahr abziehbar",22.47,"S",null,{"v":0,"d":"0.00"},null,null,{"v":0,"d":"0.00"},22.47,{"v":0,"d":"0.00"},22.47]
[1457,"Forderung gegenüber Bundesagentur",117.76,"S",null,833.87,"S",null,{"v":5920.12,"d":"5,920.12"},{"v":5204.01,"d":"5,204.01"},{"v":5920.12,"d":"5,920.12"},{"v":5204.01,"d":"5,204.01"}]
[1600,"Kasse",19.66,"S",null,49.81,"S",null,{"v":7550,"d":"7,550.00"},{"v":7519.85,"d":"7,519.85"},{"v":7550,"d":"7,550.00"},{"v":7519.85,"d":"7,519.85"}]
[1800,"SWM 50015965",{"v":8078.7,"d":"8,078.70"},"S",null,{"v":22878.98,"d":"22,878.98"},"S",null,{"v":495111.44,"d":"495,111.44"},{"v":480311.16,"d":"480,311.16"},{"v":495111.44,"d":"495,111.44"},{"v":480311.16,"d":"480,311.16"}]
[1900,"Aktive Rechnungsabgrenzung",{"v":1037.08,"d":"1,037.08"},"S",null,{"v":0,"d":"0.00"},null,null,{"v":0,"d":"0.00"},{"v":1037.08,"d":"1,037.08"},{"v":0,"d":"0.00"},{"v":1037.08,"d":"1,037.08"}]
[2010,"Variables Kapital (EK)",{"v":171712.81,"d":"171,712.81"},null,"H",{"v":93429.88,"d":"93,429.88"},null,"H",{"v":-56196.65,"d":"-56,196.65"},{"v":-134479.58,"d":"-134,479.58"},{"v":-56196.65,"d":"-56,196.65"},{"v":-134479.58,"d":"-134,479.58"}]
[2100,"Privatentnahmen allgemein",{"v":113450,"d":"113,450.00"},"S",null,{"v":112472.84,"d":"112,472.84"},"S",null,{"v":70242.84,"d":"70,242.84"},{"v":71220,"d":"71,220.00"},{"v":70242.84,"d":"70,242.84"},{"v":71220,"d":"71,220.00"}]
[2150,"Privatsteuern",{"v":7343,"d":"7,343.00"},"S",null,{"v":0,"d":"0.00"},null,null,{"v":-7343,"d":"-7,343.00"},{"v":0,"d":"0.00"},{"v":-7343,"d":"-7,343.00"},{"v":0,"d":"0.00"}]
[2180,"Privateinlagen",{"v":56196.65,"d":"56,196.65"},null,"H",{"v":339.3,"d":"339.30"},null,"H",{"v":71220,"d":"71,220.00"},{"v":15362.65,"d":"15,362.65"},{"v":71220,"d":"71,220.00"},{"v":15362.65,"d":"15,362.65"}]
[2200,"Sonderausgaben beschränkt abzugsfähig",562.03,"S",null,281.01,"S",null,-281.02,{"v":0,"d":"0.00"},-281.02,{"v":0,"d":"0.00"}]
[2201,"SA Gothaer RV",{"v":5455.6,"d":"5,455.60"},"S",null,{"v":5185.6,"d":"5,185.60"},"S",null,{"v":-270,"d":"-270.00"},{"v":0,"d":"0.00"},{"v":-270,"d":"-270.00"},{"v":0,"d":"0.00"}]
[2202,"SA Gothaer KV",{"v":5660.15,"d":"5,660.15"},"S",null,{"v":6209.77,"d":"6,209.77"},"S",null,{"v":1710.61,"d":"1,710.61"},{"v":1160.99,"d":"1,160.99"},{"v":1710.61,"d":"1,710.61"},{"v":1160.99,"d":"1,160.99"}]
[2230,"Sonderausgaben unbeschränkt abzugsfähig",{"v":1348.06,"d":"1,348.06"},"S",null,225.86,"S",null,{"v":-1122.2,"d":"-1,122.20"},{"v":0,"d":"0.00"},{"v":-1122.2,"d":"-1,122.20"},{"v":0,"d":"0.00"}]
[2250,"Zuwendungen, Spenden",{"v":350,"d":"350.00"},"S",null,{"v":0,"d":"0.00"},null,null,{"v":-350,"d":"-350.00"},{"v":0,"d":"0.00"},{"v":-350,"d":"-350.00"},{"v":0,"d":"0.00"}]
[2311,"Grundstücksaufwand Bahnhofstr. 83",164.22,"S",null,88.36,"S",null,-75.86,{"v":0,"d":"0.00"},-75.86,{"v":0,"d":"0.00"}]
[2312,"Grundstücksaufwand Bahnhofstr. 85",146.52,"S",null,82.11,"S",null,-64.41,{"v":0,"d":"0.00"},-64.41,{"v":0,"d":"0.00"}]
[3035,"Gewerbesteuerrückstellung § 4 Abs. 5b",{"v":7132,"d":"7,132.00"},null,"H",{"v":6099,"d":"6,099.00"},null,"H",{"v":1033,"d":"1,033.00"},{"v":0,"d":"0.00"},{"v":1033,"d":"1,033.00"},{"v":0,"d":"0.00"}]
{"$rows_left_out":82}